Target
Mitogen-activated protein kinase kinase kinase kinase 4
Ligand
BDBM103302
Substrate
Meas. Tech.
Selectivity screening
IC50
503±0.0 nM
Citation
 Chaikuad, ATacconi, EMZimmer, JLiang, YGray, NSTarsounas, MKnapp, S A unique inhibitor binding site in ER K1/2 is associated with slow binding kinetics Nat Chem Biol 10:853-860 (2014)  
Target
Name:
Mitogen-activated protein kinase kinase kinase kinase 4
Synonyms:
HGK KIAA0687 MAP4K4 MAPK/ERK kinase kinase kinase 4 MEKKK 4 NIK | Nck-interacting kinase
Type:
Serine/threonine-protein kinase
Mol. Mass.:
142114.73
Organism:
Homo sapiens (Human)
Description:
O95819
Residue:
1239
  
Inhibitor
Name:
BDBM103302
Synonyms:
SCH772984 | US8546404, 6
Type:
Small organic molecule
Emp. Form.:
C33H33N9O2
Mol. Mass.:
587.6742
SMILES:
O=C(CN1CC[C@@H](C1)C(=O)Nc1ccc2[nH]nc(-c3ccncc3)c2c1)N1CCN(CC1)c1ccc(cc1)-c1ncccn1
: