Target
Insulin-like growth factor 1 receptor
Ligand
BDBM122672
Substrate
Meas. Tech.
DELFIA assay
pH
7.4±n/a
IC50
0.3±n/a nM
Comments
extracted
Citation
 Treu, M Aminopyrazoloquinazolines US Patent  US8735386 Publication Date 5/27/2014 
Target
Name:
Insulin-like growth factor 1 receptor
Synonyms:
CD_antigen=CD221 IGF1R Insulin-like growth factor 1 receptor (IGF1R) Insulin-like growth factor 1 receptor alpha chain Insulin-like growth factor I receptor | Insulin-like growth factor receptor (IGFR)
Type:
Protein
Mol. Mass.:
154776.79
Organism:
Homo sapiens (Human)
Description:
P08069
Residue:
1367
  
Inhibitor
Name:
BDBM122672
Synonyms:
US8735386, I-142
Type:
Small organic molecule
Emp. Form.:
C29H32ClN7O2
Mol. Mass.:
546.063
SMILES:
COc1ccc(-c2c-3c(CCc4cnc(Nc5ccc(cc5OC)N5CCN(C)CC5)nc-34)nn2C)c(Cl)c1
: