Target
Insulin-like growth factor 1 receptor
Ligand
BDBM122699
Substrate
Meas. Tech.
DELFIA assay
pH
7.4±n/a
IC50
0.2±n/a nM
Comments
extracted
Citation
 Treu, M Aminopyrazoloquinazolines US Patent  US8735386 Publication Date 5/27/2014 
Target
Name:
Insulin-like growth factor 1 receptor
Synonyms:
CD_antigen=CD221 IGF1R Insulin-like growth factor 1 receptor (IGF1R) Insulin-like growth factor 1 receptor alpha chain Insulin-like growth factor I receptor | Insulin-like growth factor receptor (IGFR)
Type:
Protein
Mol. Mass.:
154776.79
Organism:
Homo sapiens (Human)
Description:
P08069
Residue:
1367
  
Inhibitor
Name:
BDBM122699
Synonyms:
US8735386, I-169
Type:
Small organic molecule
Emp. Form.:
C24H25ClN8OS
Mol. Mass.:
509.026
SMILES:
CC(=O)N1CCC(CC1)n1cc(Nc2ncc3CCc4nn(C)c(-c5sccc5Cl)c4-c3n2)cn1
: