Target
Insulin-like growth factor 1 receptor
Ligand
BDBM122704
Substrate
Meas. Tech.
DELFIA assay
pH
7.4±n/a
IC50
0.4±n/a nM
Comments
extracted
Citation
 Treu, M Aminopyrazoloquinazolines US Patent  US8735386 Publication Date 5/27/2014 
Target
Name:
Insulin-like growth factor 1 receptor
Synonyms:
CD_antigen=CD221 IGF1R Insulin-like growth factor 1 receptor (IGF1R) Insulin-like growth factor 1 receptor alpha chain Insulin-like growth factor I receptor | Insulin-like growth factor receptor (IGFR)
Type:
Protein
Mol. Mass.:
154776.79
Organism:
Homo sapiens (Human)
Description:
P08069
Residue:
1367
  
Inhibitor
Name:
BDBM122704
Synonyms:
US8735386, I-174
Type:
Small organic molecule
Emp. Form.:
C20H16ClN5S
Mol. Mass.:
393.893
SMILES:
Cn1nc2CCc3cnc(Nc4ccccc4)nc3-c2c1-c1sccc1Cl
: