Target
Insulin-like growth factor 1 receptor
Ligand
BDBM122706
Substrate
Meas. Tech.
DELFIA assay
pH
7.4±n/a
IC50
0.4±n/a nM
Comments
extracted
Citation
 Treu, M Aminopyrazoloquinazolines US Patent  US8735386 Publication Date 5/27/2014 
Target
Name:
Insulin-like growth factor 1 receptor
Synonyms:
CD_antigen=CD221 IGF1R Insulin-like growth factor 1 receptor (IGF1R) Insulin-like growth factor 1 receptor alpha chain Insulin-like growth factor I receptor | Insulin-like growth factor receptor (IGFR)
Type:
Protein
Mol. Mass.:
154776.79
Organism:
Homo sapiens (Human)
Description:
P08069
Residue:
1367
  
Inhibitor
Name:
BDBM122706
Synonyms:
US8735386, I-176
Type:
Small organic molecule
Emp. Form.:
C27H30N8O2
Mol. Mass.:
498.5795
SMILES:
COc1ccc(cc1)-c1c-2c(CCc3cnc(Nc4cnn(c4)C4CCN(CC4)C(C)=O)nc-23)nn1C
: