Target
Insulin-like growth factor 1 receptor
Ligand
BDBM122712
Substrate
Meas. Tech.
DELFIA assay
pH
7.4±n/a
IC50
0.6±n/a nM
Comments
extracted
Citation
 Treu, M Aminopyrazoloquinazolines US Patent  US8735386 Publication Date 5/27/2014 
Target
Name:
Insulin-like growth factor 1 receptor
Synonyms:
CD_antigen=CD221 IGF1R Insulin-like growth factor 1 receptor (IGF1R) Insulin-like growth factor 1 receptor alpha chain Insulin-like growth factor I receptor | Insulin-like growth factor receptor (IGFR)
Type:
Protein
Mol. Mass.:
154776.79
Organism:
Homo sapiens (Human)
Description:
P08069
Residue:
1367
  
Inhibitor
Name:
BDBM122712
Synonyms:
US8735386, I-182
Type:
Small organic molecule
Emp. Form.:
C25H29N9
Mol. Mass.:
455.5581
SMILES:
Cn1nc2CCc3cnc(Nc4ccn(CCN5CCNCC5)n4)nc3-c2c1-c1ccccc1
: