Target
Insulin-like growth factor 1 receptor
Ligand
BDBM122859
Substrate
Meas. Tech.
DELFIA assay
pH
7.4±n/a
IC50
0.54±n/a nM
Comments
extracted
Citation
 Treu, M Aminopyrazoloquinazolines US Patent  US8735386 Publication Date 5/27/2014 
Target
Name:
Insulin-like growth factor 1 receptor
Synonyms:
CD_antigen=CD221 IGF1R Insulin-like growth factor 1 receptor (IGF1R) Insulin-like growth factor 1 receptor alpha chain Insulin-like growth factor I receptor | Insulin-like growth factor receptor (IGFR)
Type:
Protein
Mol. Mass.:
154776.79
Organism:
Homo sapiens (Human)
Description:
P08069
Residue:
1367
  
Inhibitor
Name:
BDBM122859
Synonyms:
US8735386, III-21
Type:
Small organic molecule
Emp. Form.:
C31H34ClN7O3
Mol. Mass.:
588.1
SMILES:
COc1cc(ccc1Nc1ncc2CCc3nn(C)c(c3-c2n1)-c1ccccc1Cl)C(=O)NC1CCN(CCO)CC1
: