Target
Insulin-like growth factor 1 receptor
Ligand
BDBM122860
Substrate
Meas. Tech.
DELFIA assay
pH
7.4±n/a
IC50
0.27±n/a nM
Comments
extracted
Citation
 Treu, M Aminopyrazoloquinazolines US Patent  US8735386 Publication Date 5/27/2014 
Target
Name:
Insulin-like growth factor 1 receptor
Synonyms:
CD_antigen=CD221 IGF1R Insulin-like growth factor 1 receptor (IGF1R) Insulin-like growth factor 1 receptor alpha chain Insulin-like growth factor I receptor | Insulin-like growth factor receptor (IGFR)
Type:
Protein
Mol. Mass.:
154776.79
Organism:
Homo sapiens (Human)
Description:
P08069
Residue:
1367
  
Inhibitor
Name:
BDBM122860
Synonyms:
US8735386, III-22
Type:
Small organic molecule
Emp. Form.:
C34H38ClN7O3
Mol. Mass.:
628.164
SMILES:
COc1cc(ccc1Nc1ncc2CCc3nn(C)c(c3-c2n1)-c1ccccc1Cl)C(=O)N[C@H]1CC[C@@H](CC1)N1CCOCC1
: