Target
UDP-N-acetylmuramate--L-alanine ligase
Ligand
BDBM123127
Substrate
Meas. Tech.
E.coli MurC assay
Temperature
298.15±0 K
IC50
5±n/a nM
Citation
 Hameed P, SManjrekar, PChinnapattu, MHumnabadkar, VShanbhag, GKedari, CMudugal, NVAmbady, Ade Jonge, BLSadler, CPaul, BSriram, SKaur, PGuptha, SRaichurkar, AFleming, PEyermann, CJMcKinney, DCSambandamurthy, VKPanda, MRavishankar, S Pyrazolopyrimidines Establish MurC as a Vulnerable Target in Pseudomonas aeruginosa and Escherichia coli. ACS Chem Biol 9:2274-82 (2014)  
Target
Name:
UDP-N-acetylmuramate--L-alanine ligase
Synonyms:
MURC_ECOLI UDP-N-acetylmuramate--L-alanine ligase | murC
Type:
Protein
Mol. Mass.:
53617.78
Organism:
Escherichia coli
Description:
P17952
Residue:
491
  
Inhibitor
Name:
BDBM123127
Synonyms:
(R)-((R)-2-(4-(5-tert-butyl-1-methyl-1H-pyrazol-3-ylamino)-1H-pyrazolo[3,4-d]pyrimidin-6-ylamino)-2-phenylethyl) 2-(aminomethyl)morpholine-4-carboxylate (26)
Type:
Small organic molecule
Emp. Form.:
C27H36N10O3
Mol. Mass.:
548.6399
SMILES:
Cn1nc(Nc2nc(N[C@@H](COC(=O)N3CCOC(CN)C3)c3ccccc3)nc3n[nH]cc23)cc1C(C)(C)C
: