Target
Kinesin-like protein KIF11
Ligand
BDBM123468
Substrate
Meas. Tech.
In Vitro Assay
pH
7.5±n/a
Temperature
310.15±n/a K
IC50
0.84±n/a nM
Citation
 Barsanti, PADing, YHan, W Oxazole and thiazole compounds as KSP inhibitors US Patent  US8748626 Publication Date 6/10/2014 
Target
Name:
Kinesin-like protein KIF11
Synonyms:
EG5 KIF11_HUMAN Kinesin Spindle Protein Eg5 TRIP5 | kinesin spindle protein
Type:
PROTEIN
Mol. Mass.:
119138.97
Organism:
Homo sapiens (Human)
Description:
ChEMBL_1457426
Residue:
1056
  
Inhibitor
Name:
BDBM123468
Synonyms:
US8748626, 1
Type:
Small organic molecule
Emp. Form.:
C29H34F3N3O2S
Mol. Mass.:
545.659
SMILES:
C[C@H](O)C(=O)N(C[C@@H]1CNC[C@@H]1F)[C@@H](c1nc(sc1Cc1ccccc1)-c1cc(F)ccc1F)C(C)(C)C
: