Target
Kinesin-like protein KIF11
Ligand
BDBM123469
Substrate
Meas. Tech.
In Vitro Assay
pH
7.5±n/a
Temperature
310.15±n/a K
IC50
10±n/a nM
Citation
 Barsanti, PADing, YHan, W Oxazole and thiazole compounds as KSP inhibitors US Patent  US8748626 Publication Date 6/10/2014 
Target
Name:
Kinesin-like protein KIF11
Synonyms:
EG5 KIF11_HUMAN Kinesin Spindle Protein Eg5 TRIP5 | kinesin spindle protein
Type:
PROTEIN
Mol. Mass.:
119138.97
Organism:
Homo sapiens (Human)
Description:
ChEMBL_1457426
Residue:
1056
  
Inhibitor
Name:
BDBM123469
Synonyms:
US8748626, 2
Type:
Small organic molecule
Emp. Form.:
C31H36F3N3O2S
Mol. Mass.:
571.697
SMILES:
CC(C)(C)[C@@H](N(C[C@@H]1CNC[C@@H]1F)C(=O)[C@@H]1CCCO1)c1nc(sc1Cc1ccccc1)-c1cc(F)ccc1F
: