Target
G-protein coupled receptor 4
Ligand
BDBM123510
Substrate
Meas. Tech.
Radio Ligand Binding Assay
pH
8±n/a
IC50
74±n/a nM
Citation
 Miltz, WOberhauser, BVaupel, AVelcicky, JWeigand, KLeleti, RRLiu, YDu, Z Pyrazolo pyrimidine derivatives US Patent  US8748435 Publication Date 6/10/2014 
Target
Name:
G-protein coupled receptor 4
Synonyms:
G-protein coupled receptor 4 GPR4 | GPR4_HUMAN
Type:
Enzyme
Mol. Mass.:
40994.40
Organism:
Homo sapiens (Human)
Description:
P46093
Residue:
362
  
Inhibitor
Name:
BDBM123510
Synonyms:
US8748435, 35
Type:
Small organic molecule
Emp. Form.:
C24H28N6O
Mol. Mass.:
416.5187
SMILES:
CCc1nn2c(C)cc(C)nc2c1Cc1ccc(cc1)-c1nnc(o1)C1CCNCC1
: