Target
Beta-adrenergic receptor kinase 1
Ligand
BDBM50173319
Substrate
Meas. Tech.
Assays for Inhibition of GRKs
pH
7±n/a
IC50
130±n/a nM
Comments
extracted
Citation
 Larsen, SDHoman, KWaldschmidt, HTesmer, JJ G protein-coupled receptor kinase 2 inhibitors and methods for use of the same US Patent  US10023564 Publication Date 7/17/2018 
Target
Name:
Beta-adrenergic receptor kinase 1
Synonyms:
ADRBK1 BARK Beta-ARK-1 G-protein coupled receptor kinase 2 GRK2
Type:
Enzyme
Mol. Mass.:
79581.30
Organism:
Homo sapiens (Human)
Description:
P25098
Residue:
689
  
Inhibitor
Name:
BDBM50173319
Synonyms:
CHEMBL3809020 | US10023564, Example 11
Type:
Small organic molecule
Emp. Form.:
C29H27FN6O5
Mol. Mass.:
558.5603
SMILES:
COc1cccc(OC)c1CNC(=O)c1cc(ccc1F)C1NC(=O)NC(C)=C1C(=O)Nc1ccc2[nH]ncc2c1
: