Target
Beta-adrenergic receptor kinase 1
Ligand
BDBM50173327
Substrate
Meas. Tech.
Assays for Inhibition of GRKs
pH
7±n/a
IC50
25000±n/a nM
Comments
extracted
Citation
 Larsen, SDHoman, KWaldschmidt, HTesmer, JJ G protein-coupled receptor kinase 2 inhibitors and methods for use of the same US Patent  US10023564 Publication Date 7/17/2018 
Target
Name:
Beta-adrenergic receptor kinase 1
Synonyms:
ADRBK1 BARK Beta-ARK-1 G-protein coupled receptor kinase 2 GRK2
Type:
Enzyme
Mol. Mass.:
79581.30
Organism:
Homo sapiens (Human)
Description:
P25098
Residue:
689
  
Inhibitor
Name:
BDBM50173327
Synonyms:
CHEMBL3808499 | US10023564, Example 28
Type:
Small organic molecule
Emp. Form.:
C30H29FN6O3
Mol. Mass.:
540.5881
SMILES:
CC1=C(C(NC(=O)N1)c1ccc(F)c(CC(=O)NCc2c(C)cccc2C)c1)C(=O)Nc1ccc2[nH]ncc2c1
: