Target
Proto-oncogene tyrosine-protein kinase receptor Ret [658-1114]
Ligand
BDBM284689
Substrate
Meas. Tech.
RET Enzyme Assay
pH
7.4±n/a
IC50
11.8±n/a nM
Comments
extracted
Citation
 Andrews, SWBlake, JFChicarelli, MJGolos, AHaas, JJiang, YKolakowski, GR Substituted pyrazolo[1,5-A]pyridine compounds as RET kinase inhibitors US Patent  US10023570 Publication Date 7/17/2018 
Target
Name:
Proto-oncogene tyrosine-protein kinase receptor Ret [658-1114]
Synonyms:
CDHF12 PTC Proto-oncogene tyrosine-protein kinase receptor Ret (aa 658-1114) RET Kinase (aa 658-1114) RET_HUMAN
Type:
Mol. Mass.:
51535.16
Organism:
Homo sapiens (Human)
Description:
P07949[658-1114]
Residue:
457
  
Inhibitor
Name:
BDBM284689
Synonyms:
US10023570, Example 724 | US10174027, Example 724
Type:
Small organic molecule
Emp. Form.:
C28H26N8OS
Mol. Mass.:
522.624
SMILES:
COc1ccc(CN2CCN(CC2)c2ccc(cn2)-c2cc(cn3ncc(C#N)c23)-c2cnc(C)s2)cn1
: