Target
Tyrosine-protein phosphatase non-receptor type 4
Ligand
BDBM124260
Substrate
Meas. Tech.
PTP inhibition assay
pH
7.2±n/a
IC50
9.7e+2± 6e+3 nM
Comments
extracted
Citation
 Han, HLu, LWang, QZhu, MYuan, CXing, SFu, X Synthesis and evaluation of oxovanadium(IV) complexes of Schiff-base condensates from 5-substituted-2-hydroxybenzaldehyde and 2-substituted-benzenamine as selective inhibitors of protein tyrosine phosphatase 1B. Dalton Trans 41:11116-24 (2012)  
Target
Name:
Tyrosine-protein phosphatase non-receptor type 4
Synonyms:
Megakaryocyte protein-tyrosine phosphatase (PTP-MEG2) PTPN4 Tyrosine-protein phosphatase non-receptor type 4 (PTP-MEG1)
Type:
Protein
Mol. Mass.:
105923.44
Organism:
Homo sapiens (Human)
Description:
Residue:
926
  
Inhibitor
Name:
BDBM124260
Synonyms:
2-((5-Bromo-2-oxybenzylidene)amino)benzoato-diaqua-oxovanadium(IV) (1)
Type:
Small organic molecule
Emp. Form.:
C14H12BrNO6V
Mol. Mass.:
421.093
SMILES:
[OH2+][V]12([OH2+])(=O)OC(=O)c3ccccc3[N]1=Cc1cc(Br)ccc1O2
: