Target
Prostaglandin D2 receptor 2
Ligand
BDBM124818
Substrate
Meas. Tech.
Radioligand Binding Assay
pH
7.4±n/a
Temperature
298.15±n/a K
Ki
0.3±n/a nM
Comments
extracted
Citation
 Anderskewitz, RMartyres, DOost, TRist, WSeither, P Pyrazole compounds as CRTH2 antagonists US Patent  US8759386 Publication Date 6/24/2014 
Target
Name:
Prostaglandin D2 receptor 2
Synonyms:
CD_antigen=CD294 Chemoattractant Receptor-homologous molecule expressed on T-helper type 2 cells (CRTH2) Chemoattractant receptor-homologous molecule expressed on Th2 cells (CRTH2) G protein-coupled receptor 44 GPR44 PTGDR2 Prostaglandin D2 receptor 2 | Prostaglandin D2 receptor 2 (PGD2)
Type:
Enzyme
Mol. Mass.:
43295.45
Organism:
Homo sapiens (Human)
Description:
Q9Y5Y4
Residue:
395
  
Inhibitor
Name:
BDBM124818
Synonyms:
US8759386, 15
Type:
Small organic molecule
Emp. Form.:
C23H21N3O3S
Mol. Mass.:
419.496
SMILES:
Cc1nn(Cc2ccc(NC(=O)c3cc4ccccc4s3)cc2)c(C)c1CC(O)=O
: