Target
Prostaglandin D2 receptor 2
Ligand
BDBM124837
Substrate
Meas. Tech.
Radioligand Binding Assay
pH
7.4±n/a
Temperature
298.15±n/a K
Ki
0.3±n/a nM
Comments
extracted
Citation
 Anderskewitz, RMartyres, DOost, TRist, WSeither, P Pyrazole compounds as CRTH2 antagonists US Patent  US8759386 Publication Date 6/24/2014 
Target
Name:
Prostaglandin D2 receptor 2
Synonyms:
CD_antigen=CD294 Chemoattractant Receptor-homologous molecule expressed on T-helper type 2 cells (CRTH2) Chemoattractant receptor-homologous molecule expressed on Th2 cells (CRTH2) G protein-coupled receptor 44 GPR44 PTGDR2 Prostaglandin D2 receptor 2 | Prostaglandin D2 receptor 2 (PGD2)
Type:
Enzyme
Mol. Mass.:
43295.45
Organism:
Homo sapiens (Human)
Description:
Q9Y5Y4
Residue:
395
  
Inhibitor
Name:
BDBM124837
Synonyms:
US8759386, 34
Type:
Small organic molecule
Emp. Form.:
C25H24FN3O4
Mol. Mass.:
449.4742
SMILES:
CCc1c(oc2c(F)cccc12)C(=O)Nc1ccc(Cn2nc(C)c(CC(O)=O)c2C)cc1
: