Target
Phosphatidylinositol 4,5-bisphosphate 3-kinase catalytic subunit delta isoform
Ligand
BDBM284843
Substrate
Meas. Tech.
ADP-Glo Format PI3K Assays
pH
7.5±n/a
Temperature
298.15±n/a K
IC50
2.00±n/a nM
Comments
extracted
Citation
 Bhide, RSRuan, ZCherney, RJCornelius, LADhar, TGGong, HMarcoux, DPoss, MAQin, LShi, QTino, JA Heteroaryl substituted pyrrolotriazine amine compounds as PI3K inhibitors US Patent  US10023576 Publication Date 7/17/2018 
Target
Name:
Phosphatidylinositol 4,5-bisphosphate 3-kinase catalytic subunit delta isoform
Synonyms:
PI3-kinase p110 subunit delta PI3-kinase subunit p110-delta PIK3CD Phosphatidylinositol 4,5-biphosphate 3-kinase catalytic subunit delta (PIK3CD) Phosphatidylinositol 4,5-bisphosphate 3-kinase 110 kDa catalytic subunit delta (PI3K delta) Phosphatidylinositol 4,5-bisphosphate 3-kinase catalytic subunit delta (PI3Kdelta) Phosphatidylinositol 4,5-bisphosphate 3-kinase catalytic subunit delta isoform (PI3K delta) Phosphatidylinositol 4,5-bisphosphate 3-kinase catalytic subunit delta isoform (PI3K-delta) Phosphatidylinositol 4,5-bisphosphate 3-kinase catalytic subunit delta isoform (PI3Kdelta)
Type:
Enzyme Subunit
Mol. Mass.:
119489.41
Organism:
Homo sapiens (Human)
Description:
O00329
Residue:
1044
  
Inhibitor
Name:
BDBM284843
Synonyms:
4-(6-(4-amino-5-(1-(tetrahydro-2H-pyran-4-yl)-1H-pyrazol-5- yl)pyrrolo[2,1-f][1,2,4]triazin-7-yl)-1H-indazol-1-yl)tetrahydro- 2H-thiopyran 1,1-dioxide | US10023576, Example 33
Type:
Small organic molecule
Emp. Form.:
C27H30N8O2S
Mol. Mass.:
530.645
SMILES:
Nc1ncnn2c(cc(-c3ccnn3C3CCCCC3)c12)-c1ccc2cnn(C3CCS(=O)(=O)CC3)c2c1
: