Target
Platelet-derived growth factor receptor beta
Ligand
BDBM124970
Substrate
Meas. Tech.
Kinase Screen Assay
Kd
1.8±n/a nM
Citation
 Choi, HGSim, TGray, NZhou, WChang, JWZhang, JWeisberg, E Fused 2-aminothiazole compounds US Patent  US8765747 Publication Date 7/1/2014 
Target
Name:
Platelet-derived growth factor receptor beta
Synonyms:
Beta-type platelet-derived growth factor receptor CD_antigen=CD140b PGFRB_RAT Pdgfr1 Platelet-derived growth factor receptor (PDGFr) Platelet-derived growth factor receptor beta (PDGFRB)
Type:
PROTEIN
Mol. Mass.:
122794.58
Organism:
Rattus norvegicus
Description:
ChEMBL_177425
Residue:
1097
  
Inhibitor
Name:
BDBM124970
Synonyms:
US8765747, 2
Type:
Small organic molecule
Emp. Form.:
C31H31F3N6O2S
Mol. Mass.:
608.677
SMILES:
CCN1CCN(Cc2ccc(NC(=O)c3cccc(c3)-c3ccc4nc(NC(=O)C5CC5)sc4n3)cc2C(F)(F)F)CC1
: