Target
Dimer of Gag-Pol polyprotein [489-587,M535I,L552P,A560V,V571F,I573V]
Ligand
BDBM577
Substrate
fluorescence peptide substrate
Meas. Tech.
Fluorometric Activity Assay
pH
5.5±n/a
Temperature
303.15±n/a K
Ki
2.3±0.6 nM
Comments
Determined with the fluorometric activity assay.
Citation
 Hanlon, MHPorter, DJFurfine, ESSpaltenstein, ACarter, HLDanger, DShu, AYKaldor, IWMiller, JFSamano, VA Inhibition of wild-type and mutant human immunodeficiency virus type 1 proteases by GW0385 and other arylsulfonamides. Biochemistry 43:14500-7 (2004)  
Target
Name:
Dimer of Gag-Pol polyprotein [489-587,M535I,L552P,A560V,V571F,I573V]
Synonyms:
HIV-1 Protease Mutant (M46I,L63P,A71V,V82F,I84V)
Type:
Protein Complex
Mol. Mass.:
Description:
Components:
This complex has 2 components.
Component 1
Name:
Gag-Pol polyprotein [489-587,M535I,L552P,A560V,V571F,I573V]
Synonyms:
HIV-1 Protease Mutant (M46I,L63P,A71V,V82F,I84V) HIV-1 Protease Mutant (M46I,L63P,A71V,V82F,I84V) Chain B gag-pol
Type:
Enzyme Subunit
Mol. Mass.:
10809.15
Organism:
Human immunodeficiency virus type 1
Description:
P04585[489-587,M535I,L552P,A560V,V571F,I573V]
Residue:
99
  
Component 2
Name:
Gag-Pol polyprotein [489-587,M535I,L552P,A560V,V571F,I573V]
Synonyms:
HIV-1 Protease Mutant (M46I,L63P,A71V,V82F,I84V) HIV-1 Protease Mutant (M46I,L63P,A71V,V82F,I84V) Chain B gag-pol
Type:
Enzyme Subunit
Mol. Mass.:
10809.15
Organism:
Human immunodeficiency virus type 1
Description:
P04585[489-587,M535I,L552P,A560V,V571F,I573V]
Residue:
99
  
Inhibitor
Name:
BDBM577
Synonyms:
(3S)-oxolan-3-yl N-[(2S,3R)-4-[(4-aminobenzene)(2-methylpropyl)sulfonamido]-3-hydroxy-1-phenylbutan-2-yl]carbamate APV Amprenavir CHEMBL116 | VX-478
Type:
Small organic molecule
Emp. Form.:
C25H35N3O6S
Mol. Mass.:
505.627
SMILES:
CC(C)CN(C[C@@H](O)[C@H](Cc1ccccc1)NC(=O)O[C@H]1CCOC1)S(=O)(=O)c1ccc(N)cc1
:
Substrate
Name:
fluorescence peptide substrate
Synonyms:
Type:
Peptide
Mol. Mass.:
3467.28
Organism:
Description:
Residue:
30