Target
Collagenase 3
Ligand
BDBM126732
Substrate
Meas. Tech.
Biological Assay
IC50
0.7±n/a nM
Citation
 Abeywardane, AFarmer, BFarrow, NAGao, DAHeim-Riether, ASmith Keenan, LLMugge, IATaylor, SJXiong, ZYu, YZhang, Q Heteroaryl substituted indole compounds useful as MMP-13 inhibitors US Patent  US8785489 Publication Date 7/22/2014 
Target
Name:
Collagenase 3
Synonyms:
MMP13_MOUSE Mmp13
Type:
Protein
Mol. Mass.:
54166.75
Organism:
Mus musculus (Mouse)
Description:
Q3U9V5
Residue:
472
  
Inhibitor
Name:
BDBM126732
Synonyms:
US8785489, 4-{[({4-[2-(ethoxycarbonyl)-1H-indol-5-yl]pyridin-2-yl}carbonyl)amino]methyl}benzoic acid
Type:
Small organic molecule
Emp. Form.:
C25H21N3O5
Mol. Mass.:
443.4513
SMILES:
CCOC(=O)c1cc2cc(ccc2[nH]1)-c1ccnc(c1)C(=O)NCc1ccc(cc1)C(O)=O
: