Target
Collagenase 3
Ligand
BDBM126742
Substrate
Meas. Tech.
Biological Assay
IC50
1.6±n/a nM
Citation
 Abeywardane, AFarmer, BFarrow, NAGao, DAHeim-Riether, ASmith Keenan, LLMugge, IATaylor, SJXiong, ZYu, YZhang, Q Heteroaryl substituted indole compounds useful as MMP-13 inhibitors US Patent  US8785489 Publication Date 7/22/2014 
Target
Name:
Collagenase 3
Synonyms:
MMP13_MOUSE Mmp13
Type:
Protein
Mol. Mass.:
54166.75
Organism:
Mus musculus (Mouse)
Description:
Q3U9V5
Residue:
472
  
Inhibitor
Name:
BDBM126742
Synonyms:
US8785489, 4-[({[1-methyl-5-(2-pyrimidin-2-yl-1H-indol-5-yl)-1H-pyrazol-3-yl]carbonyl}amino)methyl]benzoic acid
Type:
Small organic molecule
Emp. Form.:
C25H20N6O3
Mol. Mass.:
452.4647
SMILES:
Cn1nc(cc1-c1ccc2[nH]c(cc2c1)-c1ncccn1)C(=O)NCc1ccc(cc1)C(O)=O
: