Target
Collagenase 3
Ligand
BDBM126746
Substrate
Meas. Tech.
Biological Assay
IC50
2±n/a nM
Citation
 Abeywardane, AFarmer, BFarrow, NAGao, DAHeim-Riether, ASmith Keenan, LLMugge, IATaylor, SJXiong, ZYu, YZhang, Q Heteroaryl substituted indole compounds useful as MMP-13 inhibitors US Patent  US8785489 Publication Date 7/22/2014 
Target
Name:
Collagenase 3
Synonyms:
MMP13_MOUSE Mmp13
Type:
Protein
Mol. Mass.:
54166.75
Organism:
Mus musculus (Mouse)
Description:
Q3U9V5
Residue:
472
  
Inhibitor
Name:
BDBM126746
Synonyms:
US8785489, ethyl 5-{4-methyl-2-[(pyridin-4-ylmethyl)carbamoyl]-1H-imidazol-5-yl}-1H-indole-2-carboxylate
Type:
Small organic molecule
Emp. Form.:
C22H21N5O3
Mol. Mass.:
403.4338
SMILES:
CCOC(=O)c1cc2cc(ccc2[nH]1)-c1nc([nH]c1C)C(=O)NCc1ccncc1
: