Target
Collagenase 3
Ligand
BDBM126756
Substrate
Meas. Tech.
Biological Assay
IC50
4±n/a nM
Citation
 Abeywardane, AFarmer, BFarrow, NAGao, DAHeim-Riether, ASmith Keenan, LLMugge, IATaylor, SJXiong, ZYu, YZhang, Q Heteroaryl substituted indole compounds useful as MMP-13 inhibitors US Patent  US8785489 Publication Date 7/22/2014 
Target
Name:
Collagenase 3
Synonyms:
MMP13_MOUSE Mmp13
Type:
Protein
Mol. Mass.:
54166.75
Organism:
Mus musculus (Mouse)
Description:
Q3U9V5
Residue:
472
  
Inhibitor
Name:
BDBM126756
Synonyms:
US8785489, N-(6,7-dihydro-5H-pyrrolo[2,1-c][1,2,4]triazol-3-ylmethyl)-5-methyl-4-[2-(3-methyl-1,2,4-oxadiazol-5-yl)-1H-indol-5-yl]-1H-imidazole-2-carboxamide
Type:
Small organic molecule
Emp. Form.:
C22H21N9O2
Mol. Mass.:
443.4612
SMILES:
Cc1noc(n1)-c1cc2cc(ccc2[nH]1)-c1nc([nH]c1C)C(=O)NCc1nnc2CCCn12
: