Target
Collagenase 3
Ligand
BDBM126768
Substrate
Meas. Tech.
Biological Assay
IC50
7±n/a nM
Citation
 Abeywardane, AFarmer, BFarrow, NAGao, DAHeim-Riether, ASmith Keenan, LLMugge, IATaylor, SJXiong, ZYu, YZhang, Q Heteroaryl substituted indole compounds useful as MMP-13 inhibitors US Patent  US8785489 Publication Date 7/22/2014 
Target
Name:
Collagenase 3
Synonyms:
MMP13_MOUSE Mmp13
Type:
Protein
Mol. Mass.:
54166.75
Organism:
Mus musculus (Mouse)
Description:
Q3U9V5
Residue:
472
  
Inhibitor
Name:
BDBM126768
Synonyms:
US8785489, ethyl 5-{5-methyl-2-[(pyridin-4-ylmethyl)carbamoyl]-1H-imidazol-4-yl}-1H-pyrrolo[2,3-c]pyridine-2-carboxylate
Type:
Small organic molecule
Emp. Form.:
C21H20N6O3
Mol. Mass.:
404.4219
SMILES:
CCOC(=O)c1cc2cc(ncc2[nH]1)-c1nc([nH]c1C)C(=O)NCc1ccncc1
: