Target
Tyrosine-protein kinase SYK
Ligand
BDBM128017
Substrate
Meas. Tech.
Homogeneous Time-Resolved Fluorescence Assay
pH
7.5±n/a
IC50
<0.50±n/a nM
Comments
extracted
Citation
 Romeo, ETMachacek, MRTrotter, BWMiller, TAAndresen, BMAnthony, NJTaoka, BMLiu, Y Amino-pyridine-containing spleen tyrosine kinase (SYK) inhibitors US Patent  US8796310 Publication Date 8/5/2014 
Target
Name:
Tyrosine-protein kinase SYK
Synonyms:
KSYK_HUMAN Spleen Tyrosine Kinase Tyrosine-protein kinase SYK (Syk)
Type:
Enzyme
Mol. Mass.:
72079.99
Organism:
Homo sapiens (Human)
Description:
P43405
Residue:
635
  
Inhibitor
Name:
BDBM128017
Synonyms:
US8796310, 1N
Type:
Small organic molecule
Emp. Form.:
C27H26N4O4S
Mol. Mass.:
502.585
SMILES:
CCOc1ccnc(Nc2cc(C)cc(n2)-c2cnc(s2)C2(O)CCCc3cc(ccc23)C(O)=O)c1
: