Target
Histamine H3 receptor
Ligand
BDBM128113
Substrate
Meas. Tech.
Competition Binding Assay
pH
7.4±n/a
Temperature
277.15±n/a K
Ki
158±n/a nM
Comments
extracted
Citation
 Black, LAGfesser, GACowart, MD 4-substituted-2-amino-pyrimidine derivatives US Patent  US8796297 Publication Date 8/5/2014 
Target
Name:
Histamine H3 receptor
Synonyms:
G-protein coupled receptor 97 HH3R HRH3 Histamine H3 receptor (H3) Histamine receptor (H3 and H4)
Type:
G Protein-Coupled Receptor (GPCR)
Mol. Mass.:
48691.47
Organism:
Homo sapiens (Human)
Description:
Binding assays were using CHO cells stably expressing hH3R receptors.
Residue:
445
  
Inhibitor
Name:
BDBM128113
Synonyms:
US8796297, 19
Type:
Small organic molecule
Emp. Form.:
C17H21N5
Mol. Mass.:
295.3821
SMILES:
Nc1nccc(n1)N1C[C@@H]2CN(Cc3ccccc3)C[C@@H]2C1
: