Target
Histamine H3 receptor
Ligand
BDBM128109
Substrate
Meas. Tech.
Competition Binding Assay
pH
7.4±n/a
Temperature
277.15±n/a K
Ki
>331±n/a nM
Comments
extracted
Citation
 Black, LAGfesser, GACowart, MD 4-substituted-2-amino-pyrimidine derivatives US Patent  US8796297 Publication Date 8/5/2014 
Target
Name:
Histamine H3 receptor
Synonyms:
HH3R Hrh3
Type:
G Protein-Coupled Receptor (GPCR)
Mol. Mass.:
48607.98
Organism:
Rattus norvegicus (rat)
Description:
Residue:
445
  
Inhibitor
Name:
BDBM128109
Synonyms:
US8796297, 15
Type:
Small organic molecule
Emp. Form.:
C15H25N5O2
Mol. Mass.:
307.3913
SMILES:
CC(C)(C)OC(=O)N1CCC(CNc2ccnc(N)n2)CC1
: