Target
Histamine H3 receptor
Ligand
BDBM128118
Substrate
Meas. Tech.
Competition Binding Assay
pH
7.4±n/a
Temperature
277.15±n/a K
Ki
105±n/a nM
Comments
extracted
Citation
 Black, LAGfesser, GACowart, MD 4-substituted-2-amino-pyrimidine derivatives US Patent  US8796297 Publication Date 8/5/2014 
Target
Name:
Histamine H3 receptor
Synonyms:
HH3R Hrh3
Type:
G Protein-Coupled Receptor (GPCR)
Mol. Mass.:
48607.98
Organism:
Rattus norvegicus (rat)
Description:
Residue:
445
  
Inhibitor
Name:
BDBM128118
Synonyms:
US8796297, 24
Type:
Small organic molecule
Emp. Form.:
C9H15N5
Mol. Mass.:
193.2489
SMILES:
Nc1nccc(NC2CCNCC2)n1
: