Target
Phosphatidylinositol 4,5-bisphosphate 3-kinase catalytic subunit gamma isoform
Ligand
BDBM128380
Substrate
Meas. Tech.
High Throughput PI3K Lipid Kinase Assay
IC50
377±n/a nM
Citation
 Quattropani, ARueckle, TSchwarz, MDorbais, JSauer, WCleva, CDesforges, G Thiazole derivatives and use thereof US Patent  US8802861 Publication Date 8/12/2014 
Target
Name:
Phosphatidylinositol 4,5-bisphosphate 3-kinase catalytic subunit gamma isoform
Synonyms:
PI3-kinase p110 subunit gamma PI3Kgamma PK3CG_HUMAN Phosphatidylinositol 4,5-bisphosphate 3-kinase (PI3K) Phosphatidylinositol 4,5-bisphosphate 3-kinase catalytic subunit gamma (PI3Kgamma) Phosphatidylinositol 4,5-bisphosphate 3-kinase catalytic subunit gamma isoform (PI3K) Phosphatidylinositol-4,5-bisphosphate 3-kinase catalytic subunit gamma isoform Phosphoinositide 3-kinases gamma (PI3K gamma) p120-PI3K
Type:
Enzyme Subunit
Mol. Mass.:
126470.30
Organism:
Homo sapiens (Human)
Description:
P48736
Residue:
1102
  
Inhibitor
Name:
BDBM128380
Synonyms:
US8802861, 56
Type:
Small organic molecule
Emp. Form.:
C13H13N6O3S2
Mol. Mass.:
365.411
SMILES:
CC(=O)Nc1nc(C)c(s1)-c1csc(NCCc2n[n-]c(=O)o2)n1
: