Target
Bromodomain-containing protein 4
Ligand
BDBM284965
Substrate
Meas. Tech.
In Vitro Enzyme Inhibition Assay
pH
7.3±n/a
IC50
2750±n/a nM
Comments
extracted
Citation
 Boloor, A Bromodomain inhibitors US Patent  US10023592 Publication Date 7/17/2018 
Target
Name:
Bromodomain-containing protein 4
Synonyms:
BRD4 Bromodomain-containing protein 4 (BRD4) Protein HUNK1
Type:
Protein
Mol. Mass.:
152264.84
Organism:
Homo sapiens (Human)
Description:
O60885
Residue:
1362
  
Inhibitor
Name:
BDBM284965
Synonyms:
N-ethyl-3-(2-methyl-1-oxo-isoquinolin-4-yl) benzenesulfonamide | US10023592, Example 10
Type:
Small organic molecule
Emp. Form.:
C18H18N2O3S
Mol. Mass.:
342.412
SMILES:
CCNS(=O)(=O)c1cccc(c1)-c1cn(C)c(=O)c2ccccc12
: