Target
Bromodomain-containing protein 4
Ligand
BDBM285292
Substrate
Meas. Tech.
In Vitro Enzyme Inhibition Assay
pH
7.3±n/a
IC50
<500±n/a nM
Comments
extracted
Citation
 Boloor, A Bromodomain inhibitors US Patent  US10023592 Publication Date 7/17/2018 
Target
Name:
Bromodomain-containing protein 4
Synonyms:
BRD4 Bromodomain-containing protein 4 (BRD4) Protein HUNK1
Type:
Protein
Mol. Mass.:
152264.84
Organism:
Homo sapiens (Human)
Description:
O60885
Residue:
1362
  
Inhibitor
Name:
BDBM285292
Synonyms:
5-(3-but-2-ynoxy-5-methylsulfonylphenyl)-1,3- dimethylpyridin-2-one US10023592, Example 340
Type:
Small organic molecule
Emp. Form.:
C18H19NO4S
Mol. Mass.:
345.413
SMILES:
CC#CCOc1cc(cc(c1)S(C)(=O)=O)-c1cc(C)c(=O)n(C)c1
: