Target
Bromodomain-containing protein 4
Ligand
BDBM285437
Substrate
Meas. Tech.
In Vitro Enzyme Inhibition Assay
pH
7.3±n/a
IC50
<500±n/a nM
Comments
extracted
Citation
 Boloor, A Bromodomain inhibitors US Patent  US10023592 Publication Date 7/17/2018 
Target
Name:
Bromodomain-containing protein 4
Synonyms:
BRD4 Bromodomain-containing protein 4 (BRD4) Protein HUNK1
Type:
Protein
Mol. Mass.:
152264.84
Organism:
Homo sapiens (Human)
Description:
O60885
Residue:
1362
  
Inhibitor
Name:
BDBM285437
Synonyms:
N-[2-ethyl-8-(2-methyl-1-oxoisoquinolin-4-yl)- 3,4-dihydro-2H-chromen-6-yl] ethanesulfonamide US10941160, Example 491
Type:
Small organic molecule
Emp. Form.:
C23H26N2O4S
Mol. Mass.:
426.529
SMILES:
CCC1CCc2cc(NS(=O)(=O)CC)cc(c2O1)-c1cn(C)c(=O)c2ccccc12
: