Target
Bromodomain-containing protein 4
Ligand
BDBM285441
Substrate
Meas. Tech.
In Vitro Enzyme Inhibition Assay
pH
7.3±n/a
IC50
<500±n/a nM
Comments
extracted
Citation
 Boloor, A Bromodomain inhibitors US Patent  US10023592 Publication Date 7/17/2018 
Target
Name:
Bromodomain-containing protein 4
Synonyms:
BRD4 Bromodomain-containing protein 4 (BRD4) Protein HUNK1
Type:
Protein
Mol. Mass.:
152264.84
Organism:
Homo sapiens (Human)
Description:
O60885
Residue:
1362
  
Inhibitor
Name:
BDBM285441
Synonyms:
N-[7-(1,5-dimethyl-6-oxopyridin-3-yl)-2- propyl-2,3-dihydro-1-benzofuran-5-yl] ethanesulfonamide US10941160, Example 495
Type:
Small organic molecule
Emp. Form.:
C20H26N2O4S
Mol. Mass.:
390.496
SMILES:
CCCC1Cc2cc(NS(=O)(=O)CC)cc(c2O1)-c1cc(C)c(=O)n(C)c1
: