Target
Bromodomain-containing protein 4
Ligand
BDBM285451
Substrate
Meas. Tech.
In Vitro Enzyme Inhibition Assay
pH
7.3±n/a
IC50
<500±n/a nM
Comments
extracted
Citation
 Boloor, A Bromodomain inhibitors US Patent  US10023592 Publication Date 7/17/2018 
Target
Name:
Bromodomain-containing protein 4
Synonyms:
BRD4 Bromodomain-containing protein 4 (BRD4) Protein HUNK1
Type:
Protein
Mol. Mass.:
152264.84
Organism:
Homo sapiens (Human)
Description:
O60885
Residue:
1362
  
Inhibitor
Name:
BDBM285451
Synonyms:
4-[2-(cyclopropylmethoxy)-5- ethylsulfonylphenyl]-2-methyl-6,7-dihydro- 5H-cyclopenta[c[pyridin-1-one US10941160, Example 505
Type:
Small organic molecule
Emp. Form.:
C21H25NO4S
Mol. Mass.:
387.493
SMILES:
CCS(=O)(=O)c1ccc(OCC2CC2)c(c1)-c1cn(C)c(=O)c2CCCc12
: