Target
Prostaglandin E2 receptor EP4 subtype
Ligand
BDBM285498
Substrate
Meas. Tech.
EP4 Antagonistic Activity Measurement
Temperature
298.15±n/a K
IC50
1.20±n/a nM
Comments
extracted
Citation
 Asada, MTani, KHirobe, MHiguchi, SFuchibe, KOikawa, RKotani, TTakano, H Tricyclic spiro compound US Patent  US10077247 Publication Date 9/18/2018 
Target
Name:
Prostaglandin E2 receptor EP4 subtype
Synonyms:
PE2R4_HUMAN PGE2 receptor EP4 subtype PTGER4 Prostanoid EP4 receptor
Type:
Enzyme
Mol. Mass.:
53134.53
Organism:
Homo sapiens (Human)
Description:
P35408
Residue:
488
  
Inhibitor
Name:
BDBM285498
Synonyms:
4-[4-Cyano-2-({[(1R,2R)-6′-(methylcarbamoyl)-2′,3′-dihydrospiro[cyclopropane-1, 1′-inden]-2-yl]carbonyl}amino)phenyl]butanoic acid | US10077247, Example 18-1
Type:
Small organic molecule
Emp. Form.:
C25H25N3O4
Mol. Mass.:
431.4837
SMILES:
CNC(=O)c1ccc2CC[C@]3(C[C@H]3C(=O)Nc3cc(ccc3CCCC(O)=O)C#N)c2c1
: