Target
Isoform PNNOS of Nitric oxide synthase, brain (PNNOS) -973,I269V,H341L]
Ligand
BDBM130385
Substrate
Meas. Tech.
Spectral Binding Assay
pH
7.5±n/a
Temperature
298.15±n/a K
Kd
632± 198 nM
Comments
extracted
Citation
 Li, HJamal, JDelker, SPlaza, CJi, HJing, QHuang, HKang, SSilverman, RBPoulos, TL The mobility of a conserved tyrosine residue controls isoform-dependent enzyme-inhibitor interactions in nitric oxide synthases. Biochemistry 53:5272-9 (2014)  
Target
Name:
Isoform PNNOS of Nitric oxide synthase, brain (PNNOS) -973,I269V,H341L]
Synonyms:
Bnos Nitric oxide synthase mutant (nNOS H341L) Nos1
Type:
Protein
Mol. Mass.:
108443.38
Organism:
Rattus norvegicus (rats)
Description:
Rat neuronal nitric oxide synthase mutant H341L
Residue:
973
  
Inhibitor
Name:
BDBM130385
Synonyms:
6(3amino2{5[2(6amino4methylpyridin2 yl)ethyl]pyridin3yl}propyl)4methylpyridin2amine (7)
Type:
Small organic molecule
Emp. Form.:
C22H28N6
Mol. Mass.:
376.4979
SMILES:
Cc1cc(N)nc(CCc2cncc(c2)C(CN)Cc2cc(C)cc(N)n2)c1
: