Target
High affinity nerve growth factor receptor
Ligand
BDBM130913
Substrate
Meas. Tech.
In Vitro Kinase Activity Assay
pH
7.5±n/a
IC50
6.353±n/a nM
Comments
extracted
Citation
 Gregor, VE Tyrosine kinase inhibitors US Patent  US8822500 Publication Date 9/2/2014 
Target
Name:
High affinity nerve growth factor receptor
Synonyms:
2.7.10.1 NTRK1 NTRK1_HUMAN Neurotrophic tyrosine kinase receptor type 1 Synonyms=MTC TRK1-transforming tyrosine kinase protein TRKA GN Trk-A Tropomyosin-related kinase A Tyrosine kinase receptor Tyrosine kinase receptor A Tyrosine kinase receptor A (Trk-A) gp140trk | p140-TrkA
Type:
Mol. Mass.:
87498.18
Organism:
Homo sapiens (Human)
Description:
P04629
Residue:
796
  
Inhibitor
Name:
BDBM130913
Synonyms:
US8822500, [28]
Type:
Small organic molecule
Emp. Form.:
C29H28F2N6O3
Mol. Mass.:
546.5678
SMILES:
CC(Cc1cc(F)ccc1F)Nc1cc[nH]c(=O)c1-c1nc2cc3C(=O)N(C4CCN(C)CC4)C(=O)c3cc2[nH]1
: