Target
High affinity nerve growth factor receptor
Ligand
BDBM130921
Substrate
Meas. Tech.
In Vitro Kinase Activity Assay
pH
7.5±n/a
IC50
5.992±n/a nM
Comments
extracted
Citation
 Gregor, VE Tyrosine kinase inhibitors US Patent  US8822500 Publication Date 9/2/2014 
Target
Name:
High affinity nerve growth factor receptor
Synonyms:
2.7.10.1 NTRK1 NTRK1_HUMAN Neurotrophic tyrosine kinase receptor type 1 Synonyms=MTC TRK1-transforming tyrosine kinase protein TRKA GN Trk-A Tropomyosin-related kinase A Tyrosine kinase receptor Tyrosine kinase receptor A Tyrosine kinase receptor A (Trk-A) gp140trk | p140-TrkA
Type:
Mol. Mass.:
87498.18
Organism:
Homo sapiens (Human)
Description:
P04629
Residue:
796
  
Inhibitor
Name:
BDBM130921
Synonyms:
US8822500, [24A]
Type:
Small organic molecule
Emp. Form.:
C30H30F4N6O2
Mol. Mass.:
582.5918
SMILES:
CC(Cc1c(F)c(F)cc(F)c1F)Nc1cc[nH]c(=O)c1-c1nc2c(C)c3CN(C4CCN(C)CC4)C(=O)c3cc2[nH]1
: