Target
Steroid 17-alpha-hydroxylase/17,20 lyase
Ligand
BDBM132127
Substrate
Meas. Tech.
Enzyme Assay
IC50
5±n/a nM
Citation
 Bock, MGGaul, CGunmadi, VRSengupta, S Inhibitors of CYP 17 US Patent  USRE45173 Publication Date 9/30/2014 
Target
Name:
Steroid 17-alpha-hydroxylase/17,20 lyase
Synonyms:
CP17A_RAT Cyp17a1 Cytochrome P450 17A1 Steroid 17-alpha-hydroxylase/17,20 lyase
Type:
Enzyme
Mol. Mass.:
57255.68
Organism:
Rattus norvegicus (Rat)
Description:
P11715
Residue:
507
  
Inhibitor
Name:
BDBM132127
Synonyms:
USRE45173, 52A
Type:
Small organic molecule
Emp. Form.:
C18H16N4O
Mol. Mass.:
304.3458
SMILES:
Cc1ccncc1N1CCN(C1=O)c1ccc2ncccc2c1
: