Target
Cyclin-dependent kinase 6
Ligand
BDBM132548
Substrate
Meas. Tech.
In Vitro Assay
pH
7.4±n/a
Temperature
310.15±n/a K
IC50
13±n/a nM
Citation
 Connors, RVKang, DEksterowicz, JFan, PFisher, BFu, JLi, KLi, ZMcGee, LRSharma, RWang, XMcMinn, DLMihalic, JTDeignan, J Fused pyridine, pyrimidine and triazine compounds as cell cycle inhibitors US Patent  US8841312 Publication Date 9/23/2014 
Target
Name:
Cyclin-dependent kinase 6
Synonyms:
CDK6 CDKN6 Cyclin-dependent kinase 6 (CDK 6) | Serine/threonine-protein kinase PLSTIRE
Type:
Enzyme Subunit
Mol. Mass.:
36937.42
Organism:
Homo sapiens (Human)
Description:
Q00534
Residue:
326
  
Inhibitor
Name:
BDBM132548
Synonyms:
US8841312, 297
Type:
Small organic molecule
Emp. Form.:
C21H24N8O
Mol. Mass.:
404.4683
SMILES:
OCCCNc1ccc(Nc2ncc3c(n2)n(C2CCCC2)c2cnccc32)nn1
: