Target
Isoform 4 of cAMP-specific 3',5'-cyclic phosphodiesterase 4A (RD1)
Ligand
BDBM285539
Substrate
Meas. Tech.
The PDE4A3, PDE4B1, PDE4C1 and PDE4D3 assays
IC50
14.4±n/a nM
Citation
 Chappie, TAPatel, NCHayward, MMHelal, CJSciabola, SLaChapelle, EAYoung, JMVerhoest, PR Imidazopyridazine compounds US Patent  US10077269 Publication Date 9/18/2018 
Target
Name:
Isoform 4 of cAMP-specific 3',5'-cyclic phosphodiesterase 4A (RD1)
Synonyms:
DPDE2 PDE4A1 Phosphodiesterase 4A (PDE4A1) cAMP-specific 3',5'-cyclic phosphodiesterase 4A (RD1) | cAMP-specific 3',5'-cyclic phosphodiesterase 4A Isoform 4
Type:
Enzyme Catalytic Domain
Mol. Mass.:
72186.86
Organism:
Homo sapiens (Human)
Description:
P27815-4
Residue:
647
  
Inhibitor
Name:
BDBM285539
Synonyms:
3-(4-chloro-2-methyl-phenyl)-N-cyclopropyl-imidazo[1,2-b]pyridazine-2-carboxamide US10669279, Example 12 | US9598421, Example 12
Type:
Small organic molecule
Emp. Form.:
C17H15ClN4O
Mol. Mass.:
326.78
SMILES:
Cc1cc(Cl)ccc1-c1c(nc2cccnn12)C(=O)NC1CC1
: