Target
Isoform 4 of cAMP-specific 3',5'-cyclic phosphodiesterase 4A (RD1)
Ligand
BDBM285540
Substrate
Meas. Tech.
The PDE4A3, PDE4B1, PDE4C1 and PDE4D3 assays
IC50
5.13±n/a nM
Citation
 Chappie, TAPatel, NCHayward, MMHelal, CJSciabola, SLaChapelle, EAYoung, JMVerhoest, PR Imidazopyridazine compounds US Patent  US10077269 Publication Date 9/18/2018 
Target
Name:
Isoform 4 of cAMP-specific 3',5'-cyclic phosphodiesterase 4A (RD1)
Synonyms:
DPDE2 PDE4A1 Phosphodiesterase 4A (PDE4A1) cAMP-specific 3',5'-cyclic phosphodiesterase 4A (RD1) | cAMP-specific 3',5'-cyclic phosphodiesterase 4A Isoform 4
Type:
Enzyme Catalytic Domain
Mol. Mass.:
72186.86
Organism:
Homo sapiens (Human)
Description:
P27815-4
Residue:
647
  
Inhibitor
Name:
BDBM285540
Synonyms:
US10077269, Example 13 US9598421, Example 13 | azetidin-1-yl[3-(4-chloro-3-fluorophenyl)imidazo[1,2-b]pyridazin-2-yl]methanone
Type:
Small organic molecule
Emp. Form.:
C16H12ClFN4O
Mol. Mass.:
330.744
SMILES:
Fc1cc(ccc1Cl)-c1c(nc2cccnn12)C(=O)N1CCC1
: