Target
Isoform 4 of cAMP-specific 3',5'-cyclic phosphodiesterase 4A (RD1)
Ligand
BDBM285551
Substrate
Meas. Tech.
The PDE4A3, PDE4B1, PDE4C1 and PDE4D3 assays
IC50
5.04±n/a nM
Citation
 Chappie, TAPatel, NCHayward, MMHelal, CJSciabola, SLaChapelle, EAYoung, JMVerhoest, PR Imidazopyridazine compounds US Patent  US10077269 Publication Date 9/18/2018 
Target
Name:
Isoform 4 of cAMP-specific 3',5'-cyclic phosphodiesterase 4A (RD1)
Synonyms:
DPDE2 PDE4A1 Phosphodiesterase 4A (PDE4A1) cAMP-specific 3',5'-cyclic phosphodiesterase 4A (RD1) | cAMP-specific 3',5'-cyclic phosphodiesterase 4A Isoform 4
Type:
Enzyme Catalytic Domain
Mol. Mass.:
72186.86
Organism:
Homo sapiens (Human)
Description:
P27815-4
Residue:
647
  
Inhibitor
Name:
BDBM285551
Synonyms:
4-[2-(azetidin-1-ylcarbonyl)imidazo[1,2-b]pyridazin-3-yl]-2,5-difluorobenzonitrile US10669279, Example 24 | US9598421, Example 24
Type:
Small organic molecule
Emp. Form.:
C17H11F2N5O
Mol. Mass.:
339.2989
SMILES:
Fc1cc(-c2c(nc3cccnn23)C(=O)N2CCC2)c(F)cc1C#N
: