Target
cAMP-specific 3',5'-cyclic phosphodiesterase 4B [122-736,S654A]
Ligand
BDBM285556
Substrate
Meas. Tech.
The PDE4A3, PDE4B1, PDE4C1 and PDE4D3 assays
IC50
5.05±n/a nM
Citation
 Chappie, TAPatel, NCHayward, MMHelal, CJSciabola, SLaChapelle, EAYoung, JMVerhoest, PR Imidazopyridazine compounds US Patent  US10077269 Publication Date 9/18/2018 
Target
Name:
cAMP-specific 3',5'-cyclic phosphodiesterase 4B [122-736,S654A]
Synonyms:
DPDE4 PDE4B1 cAMP-specific 3',5'-cyclic phosphodiesterase 4B
Type:
Enzyme Catalytic Domain
Mol. Mass.:
70253.85
Organism:
Homo sapiens (Human)
Description:
Q07343[122-736,S654A]
Residue:
615
  
Inhibitor
Name:
BDBM285556
Synonyms:
3-(4-chloro-3-fluorophenyl)-N-propylimidazo[1,2-b]pyridazine-2-carboxamide US10669279, Example 29 | US9598421, Example 29
Type:
Small organic molecule
Emp. Form.:
C16H14ClFN4O
Mol. Mass.:
332.76
SMILES:
CCCNC(=O)c1nc2cccnn2c1-c1ccc(Cl)c(F)c1
: