Target
Isoform 4 of cAMP-specific 3',5'-cyclic phosphodiesterase 4A (RD1)
Ligand
BDBM285598
Substrate
Meas. Tech.
The PDE4A3, PDE4B1, PDE4C1 and PDE4D3 assays
IC50
<0.669±n/a nM
Citation
 Chappie, TAPatel, NCHayward, MMHelal, CJSciabola, SLaChapelle, EAYoung, JMVerhoest, PR Imidazopyridazine compounds US Patent  US10077269 Publication Date 9/18/2018 
Target
Name:
Isoform 4 of cAMP-specific 3',5'-cyclic phosphodiesterase 4A (RD1)
Synonyms:
DPDE2 PDE4A1 Phosphodiesterase 4A (PDE4A1) cAMP-specific 3',5'-cyclic phosphodiesterase 4A (RD1) | cAMP-specific 3',5'-cyclic phosphodiesterase 4A Isoform 4
Type:
Enzyme Catalytic Domain
Mol. Mass.:
72186.86
Organism:
Homo sapiens (Human)
Description:
P27815-4
Residue:
647
  
Inhibitor
Name:
BDBM285598
Synonyms:
3-(3-chloro-4-methylphenyl)-N-[(1R,2S)-2-fluorocyclopro-pyl]imidazo[1,2-b]pyridazine-2-carboxamide US10669279, Example 71 | US9598421, Example 71
Type:
Small organic molecule
Emp. Form.:
C17H14ClFN4O
Mol. Mass.:
344.771
SMILES:
Cc1ccc(cc1Cl)-c1c(nc2cccnn12)C(=O)N[C@@H]1C[C@@H]1F
: