Target
cAMP-specific 3',5'-cyclic phosphodiesterase 4B [122-736,S654A]
Ligand
BDBM285603
Substrate
Meas. Tech.
The PDE4A3, PDE4B1, PDE4C1 and PDE4D3 assays
IC50
5.43±n/a nM
Citation
 Chappie, TAPatel, NCHayward, MMHelal, CJSciabola, SLaChapelle, EAYoung, JMVerhoest, PR Imidazopyridazine compounds US Patent  US10077269 Publication Date 9/18/2018 
Target
Name:
cAMP-specific 3',5'-cyclic phosphodiesterase 4B [122-736,S654A]
Synonyms:
DPDE4 PDE4B1 cAMP-specific 3',5'-cyclic phosphodiesterase 4B
Type:
Enzyme Catalytic Domain
Mol. Mass.:
70253.85
Organism:
Homo sapiens (Human)
Description:
Q07343[122-736,S654A]
Residue:
615
  
Inhibitor
Name:
BDBM285603
Synonyms:
US10077269, Example 76 US9598421, Example 76 | azetidin-1-yl{3-[2-(difluoro-methoxy)pyridin-4-yl]imidazo[1,2-b]pyridazin-2-yl}methanone
Type:
Small organic molecule
Emp. Form.:
C16H13F2N5O2
Mol. Mass.:
345.3035
SMILES:
FC(F)Oc1cc(ccn1)-c1c(nc2cccnn12)C(=O)N1CCC1
: