Target
Cyclin-dependent kinase 1
Ligand
BDBM50358212
Substrate
Meas. Tech.
Kinase Assay
pH
7.4±n/a
IC50
4900±n/a nM
Comments
extracted
Citation
 Fischer, PMJarman, MMcDonald, ENutley, BRaynaud, FWilson, SWorkman, P Purine derivatives US Patent  US8846696 Publication Date 9/30/2014 
Target
Name:
Cyclin-dependent kinase 1
Synonyms:
CDC2 CDK1 CDKN1 Cell division protein kinase 1 P34CDC2 | p34 protein kinase
Type:
Enzyme Subunit
Mol. Mass.:
34101.08
Organism:
Homo sapiens (Human)
Description:
P06493
Residue:
297
  
Inhibitor
Name:
BDBM50358212
Synonyms:
CHEMBL1922218 | US8846696, (2S3R)-3-{9-Isopropyl-6-[(pyridin-3-ylmethyl)-amino]-9H-purin-2-ylamino}-pentan-2-ol
Type:
Small organic molecule
Emp. Form.:
C19H27N7O
Mol. Mass.:
369.464
SMILES:
CC[C@@H](Nc1nc(NCc2cccnc2)c2ncn(C(C)C)c2n1)[C@H](C)O
: