Target
Bifunctional dihydrofolate reductase-thymidylate synthase
Ligand
BDBM50329607
Substrate
Meas. Tech.
Spectrophotometric Enzyme Assay
IC50
19±n/a nM
Citation
 Anderson, ACWright, DLFrey, KMPaulsen, JLScocchera, EWViswanathan, K Heterocyclic analogs of propargyl-linked inhibitors of dihydrofolate reductase US Patent  US8853228 Publication Date 10/7/2014 
Target
Name:
Bifunctional dihydrofolate reductase-thymidylate synthase
Synonyms:
ChDHFR-TS | Dihydrofolate Reductase (DHFR)
Type:
Enzyme
Mol. Mass.:
60186.98
Organism:
Cryptosporidium hominis
Description:
ChDHFR-TS was expressed in E. coli and purified using a methotrexate agarose column.
Residue:
521
  
Inhibitor
Name:
BDBM50329607
Synonyms:
5-(3-(3-methoxybiphenyl-4-yl)but-1-ynyl)-6-methylpyrimidine-2,4-diamine | CHEMBL1270837
Type:
Small organic molecule
Emp. Form.:
C22H22N4O
Mol. Mass.:
358.4363
SMILES:
COc1cc(ccc1C(C)C#Cc1c(C)nc(N)nc1N)-c1ccccc1
: